Target
Phenylalanine--tRNA ligase alpha/beta subunit
Ligand
BDBM18094
Substrate
BDBM18073
Meas. Tech.
Homogeneous Enzyme Assay with SPA Beads
pH
7.9±n/a
Temperature
310.15±n/a K
IC50
220±n/a nM
Citation
 Jarvest, RLErskine, SGForrest, AKFosberry, APHibbs, MJJones, JJO'Hanlon, PJSheppard, RJWorby, A Discovery and optimisation of potent, selective, ethanolamine inhibitors of bacterial phenylalanyl tRNA synthetase. Bioorg Med Chem Lett 15:2305-9 (2005)  
Target
Name:
Phenylalanine--tRNA ligase alpha/beta subunit
Synonyms:
tRNA synthetase (PheRS)
Type:
Tetramer of two alpha and two beta chains.
Mol. Mass.:
Description:
Components:
This complex has 4 components.
Component 1
Name:
Phenylalanine--tRNA ligase alpha subunit
Synonyms:
Phenylalanine--tRNA ligase alpha chain pheS | tRNA synthetase (PheRS) alpha chain
Type:
Enzyme Subunit
Mol. Mass.:
40113.71
Organism:
Staphylococcus aureus
Description:
Residue:
352
  
Component 2
Name:
Phenylalanine--tRNA ligase alpha subunit
Synonyms:
Phenylalanine--tRNA ligase alpha chain pheS | tRNA synthetase (PheRS) alpha chain
Type:
Enzyme Subunit
Mol. Mass.:
40113.71
Organism:
Staphylococcus aureus
Description:
Residue:
352
  
Component 3
Name:
Phenylalanine--tRNA ligase beta subunit
Synonyms:
Phenylalanine--tRNA ligase beta chain SYFB_STAAU tRNA synthetase (PheRS) beta chain
Type:
Enzyme Subunit
Mol. Mass.:
88924.81
Organism:
Staphylococcus aureus
Description:
Residue:
800
  
Component 4
Name:
Phenylalanine--tRNA ligase beta subunit
Synonyms:
Phenylalanine--tRNA ligase beta chain SYFB_STAAU tRNA synthetase (PheRS) beta chain
Type:
Enzyme Subunit
Mol. Mass.:
88924.81
Organism:
Staphylococcus aureus
Description:
Residue:
800
  
Inhibitor
Name:
BDBM18094
Synonyms:
2-({[2-(2-aminoethoxy)phenyl]methyl}amino)-1-(4-bromothiophen-2-yl)ethan-1-ol | ethanolamine, 39
Type:
Small organic molecule
Emp. Form.:
C15H19BrN2O2S
Mol. Mass.:
371.293
SMILES:
NCCOc1ccccc1CNCC(O)c1cc(Br)cs1
:
Substrate
Name:
BDBM18073
Synonyms:
(2S)-2-amino-3-phenylpropanoic acid L-[2,3,4,5,6-3H]phenylalanine Phenylalanine | US11021454, Compound L-phe
Type:
Amino Acid
Emp. Form.:
C9H11NO2
Mol. Mass.:
165.1891
SMILES:
N[C@@H](Cc1ccccc1)C(O)=O
: