Target
Phenylalanine--tRNA ligase alpha/beta subunit
Ligand
BDBM18107
Substrate
BDBM18073
Meas. Tech.
Homogeneous Enzyme Assay with SPA Beads
pH
2±n/a
IC50
110±n/a nM
Comments
extracted
Citation
 Jarvest, RLErskine, SGForrest, AKFosberry, APHibbs, MJJones, JJO'Hanlon, PJSheppard, RJWorby, A Discovery and optimisation of potent, selective, ethanolamine inhibitors of bacterial phenylalanyl tRNA synthetase. Bioorg Med Chem Lett 15:2305-9 (2005)  
Target
Name:
Phenylalanine--tRNA ligase alpha/beta subunit
Synonyms:
tRNA synthetase (PheRS)
Type:
Tetramer of two alpha and two beta chains.
Mol. Mass.:
Description:
Components:
This complex has 4 components.
Component 1
Name:
Phenylalanine--tRNA ligase alpha subunit
Synonyms:
Phenylalanine--tRNA ligase alpha chain pheS | tRNA synthetase (PheRS) alpha chain
Type:
Enzyme Subunit
Mol. Mass.:
40113.71
Organism:
Staphylococcus aureus
Description:
Residue:
352
  
Component 2
Name:
Phenylalanine--tRNA ligase alpha subunit
Synonyms:
Phenylalanine--tRNA ligase alpha chain pheS | tRNA synthetase (PheRS) alpha chain
Type:
Enzyme Subunit
Mol. Mass.:
40113.71
Organism:
Staphylococcus aureus
Description:
Residue:
352
  
Component 3
Name:
Phenylalanine--tRNA ligase beta subunit
Synonyms:
Phenylalanine--tRNA ligase beta chain SYFB_STAAU tRNA synthetase (PheRS) beta chain
Type:
Enzyme Subunit
Mol. Mass.:
88924.81
Organism:
Staphylococcus aureus
Description:
Residue:
800
  
Component 4
Name:
Phenylalanine--tRNA ligase beta subunit
Synonyms:
Phenylalanine--tRNA ligase beta chain SYFB_STAAU tRNA synthetase (PheRS) beta chain
Type:
Enzyme Subunit
Mol. Mass.:
88924.81
Organism:
Staphylococcus aureus
Description:
Residue:
800
  
Inhibitor
Name:
BDBM18107
Synonyms:
2-[2-({[2-(4-bromothiophen-2-yl)-2-hydroxyethyl]amino}methyl)phenoxy]-N-(2-hydroxyethyl)-N-methylacetamide | ethanolamine, 52
Type:
Small organic molecule
Emp. Form.:
C18H23BrN2O4S
Mol. Mass.:
443.355
SMILES:
CN(CCO)C(=O)COc1ccccc1CNCC(O)c1cc(Br)cs1
:
Substrate
Name:
BDBM18073
Synonyms:
(2S)-2-amino-3-phenylpropanoic acid L-[2,3,4,5,6-3H]phenylalanine Phenylalanine | US11021454, Compound L-phe
Type:
Amino Acid
Emp. Form.:
C9H11NO2
Mol. Mass.:
165.1891
SMILES:
N[C@@H](Cc1ccccc1)C(O)=O
: