Target
Phosphatidylinositol 3-kinase regulatory subunit beta
Ligand
BDBM357275
Substrate
Meas. Tech.
TR-FRET PI3K Beta Assay
IC50
4.00±n/a nM
Citation
 Chandrasekhar, JCodelli, JANaduthambi, DPatel, LPerreault, SPhillips, GSedillo, KFTreiberg, JAVan Veldhuizen, JWatkins, WJ Phosphatidylinositol 3-kinase inhibitors US Patent  US10214519 Publication Date 2/26/2019 
Target
Name:
Phosphatidylinositol 3-kinase regulatory subunit beta
Synonyms:
P85B_HUMAN PI3-kinase subunit p85-beta PIK3R2 PtdIns-3-kinase regulatory subunit beta | PtdIns-3-kinase regulatory subunit p85-beta
Type:
Enzyme Subunit
Mol. Mass.:
81542.75
Organism:
Homo sapiens (Human)
Description:
O00459
Residue:
728
  
Inhibitor
Name:
BDBM357275
Synonyms:
US10214519, Example 1
Type:
Small organic molecule
Emp. Form.:
C25H24ClN7O
Mol. Mass.:
473.957
SMILES:
CCCc1nc2c(cc(cc2n1-c1ccnc2c(Cl)cccc12)N1CCOCC1)-c1nnc[nH]1
: