Target
Phosphatidylinositol 3-kinase regulatory subunit beta
Ligand
BDBM357626
Substrate
Meas. Tech.
TR-FRET PI3K Beta Assay
IC50
9.00±n/a nM
Citation
 Chandrasekhar, JCodelli, JANaduthambi, DPatel, LPerreault, SPhillips, GSedillo, KFTreiberg, JAVan Veldhuizen, JWatkins, WJ Phosphatidylinositol 3-kinase inhibitors US Patent  US10214519 Publication Date 2/26/2019 
Target
Name:
Phosphatidylinositol 3-kinase regulatory subunit beta
Synonyms:
P85B_HUMAN PI3-kinase subunit p85-beta PIK3R2 PtdIns-3-kinase regulatory subunit beta | PtdIns-3-kinase regulatory subunit p85-beta
Type:
Enzyme Subunit
Mol. Mass.:
81542.75
Organism:
Homo sapiens (Human)
Description:
O00459
Residue:
728
  
Inhibitor
Name:
BDBM357626
Synonyms:
US10214519, Example 392
Type:
Small organic molecule
Emp. Form.:
C25H22N10O
Mol. Mass.:
478.5086
SMILES:
Cc1nc2c(cc(cc2n1-c1c(cnc2ccccc12)-c1nnc[nH]1)N1CCOCC1)-c1nnc[nH]1
: