Target
Androgen receptor
Ligand
BDBM18216
Substrate
BDBM18161
Meas. Tech.
AR Transcriptional Activation Assay and MDA Whole-Cell Binding Assay
Ki
7.1±n/a nM
EC50
1.1±n/a nM
Citation
 Higuchi, RIArienti, KLLópez, FJMani, NSMais, DECaferro, TRLong, YOJones, TKEdwards, JPZhi, LSchrader, WTNegro-Vilar, AMarschke, KB Novel series of potent, nonsteroidal, selective androgen receptor modulators based on 7H-[1,4]oxazino[3,2-g]quinolin-7-ones. J Med Chem 50:2486-96 (2007)  
Target
Name:
Androgen receptor
Synonyms:
ANDR_HUMAN Androgen Receptor Androgen receptor/Baculoviral IAP repeat-containing protein 2 Dihydrotestosterone receptor Nuclear receptor subfamily 3 group C member 4
Type:
Receptor
Mol. Mass.:
99185.27
Organism:
Homo sapiens (Human)
Description:
CHO cells were stably transfected with human AR gene.
Residue:
920
  
Inhibitor
Name:
BDBM18216
Synonyms:
(2R)-2-methyl-1-(2,2,2-trifluoroethyl)-9-(trifluoromethyl)-1H,2H,3H,6H,7H-quinolino[7,6-b][1,4]oxazin-7-one CHEMBL224263
Type:
Small organic molecule
Emp. Form.:
C15H12F6N2O2
Mol. Mass.:
366.2584
SMILES:
C[C@@H]1COc2cc3[nH]c(=O)cc(c3cc2N1CC(F)(F)F)C(F)(F)F
:
Substrate
Name:
BDBM18161
Synonyms:
(1S,2S,7S,10R,11S,14S,15S)-14-hydroxy-2,15-dimethyltetracyclo[8.7.0.0^{2,7}.0^{11,15}]heptadecan-5-one CHEMBL27769 Dihydrotestosterone | [3H]DHT
Type:
Steroid
Emp. Form.:
C19H30O2
Mol. Mass.:
290.4403
SMILES:
[H][C@@]12CC[C@H](O)[C@@]1(C)CC[C@@]1([H])[C@@]2([H])CC[C@@]2([H])CC(=O)CC[C@]12C
: