Target
Beta-secretase 1
Ligand
BDBM228439
Substrate
Meas. Tech.
In Vivo Inhibition of Beta-Secretase
IC50
0.600±n/a nM
Citation
 Lewis, RTAllen, JRCheng, YChoquette, DEpstein, OGuzman-Perez, AHarrington, PEHua, ZHungate, RWHuman, JBJudd, TLiu, QLopez, PMinatti, AEOlivieri, PRomero, KRumfelt, SRzasa, RMSchenkel, LStellwagen, JWhite, RXue, QZheng, XMZhong, W Amino-dihydrothiazine and amino-dioxido dihydrothiazine compounds as beta-secretase antagonists and methods of use US Patent  US9556135 Publication Date 1/31/2017 
Target
Name:
Beta-secretase 1
Synonyms:
ASP2 Aspartyl protease 2 BACE1 Beta-secretase (BACE) Beta-secretase 1 (BACE 1) Beta-secretase 1 (BACE1) Beta-site amyloid precursor protein cleaving enzyme 1 Memapsin-2 beta-Secretase (BACE-1) | beta-Secretase (BACE1)
Type:
Protein
Mol. Mass.:
55755.10
Organism:
Homo sapiens (Human)
Description:
P56817
Residue:
501
  
Inhibitor
Name:
BDBM228439
Synonyms:
US9556135, 24
Type:
Small organic molecule
Emp. Form.:
C19H19ClF2N4O3S
Mol. Mass.:
456.894
SMILES:
CC1(C)C(N)=N[C@@](C)(CS1(=O)=O)c1cc(NC(=O)c2ncc(Cl)cc2F)ccc1F
: