Target
Cathepsin D
Ligand
BDBM228474
Substrate
Meas. Tech.
In Vitro Enzymatic
pH
3.5±n/a
IC50
200000±n/a nM
Comments
extracted
Citation
 Lewis, RTAllen, JRCheng, YChoquette, DEpstein, OGuzman-Perez, AHarrington, PEHua, ZHungate, RWHuman, JBJudd, TLiu, QLopez, PMinatti, AEOlivieri, PRomero, KRumfelt, SRzasa, RMSchenkel, LStellwagen, JWhite, RXue, QZheng, XMZhong, W Amino-dihydrothiazine and amino-dioxido dihydrothiazine compounds as beta-secretase antagonists and methods of use US Patent  US9556135 Publication Date 1/31/2017 
Target
Name:
Cathepsin D
Synonyms:
CATD_HUMAN CTSD Cathepsin D heavy chain Cathepsin D precursor
Type:
Enzyme
Mol. Mass.:
44551.72
Organism:
Homo sapiens (Human)
Description:
Human proCathepsin D (SwissProt accession number P07339) was expressed in Sf9 cells, purified, and autoactivated.
Residue:
412
  
Inhibitor
Name:
BDBM228474
Synonyms:
US9556135, 196
Type:
Small organic molecule
Emp. Form.:
C21H24ClFN4O3S
Mol. Mass.:
466.957
SMILES:
CCc1cc(Cl)cnc1C(=O)Nc1ccc(F)c(c1)[C@]1(C)CS(=O)(=O)C(C)(C)C(N)=N1
: