Target
Fibroblast growth factor receptor 2
Ligand
BDBM357698
Substrate
Meas. Tech.
TBD
IC50
>200±n/a nM
Citation
 Lu, LWu, LQian, DYao, W Bicyclic heterocycles as FGFR4 inhibitors US Patent  US10214528 Publication Date 2/26/2019 
Target
Name:
Fibroblast growth factor receptor 2
Synonyms:
BEK FGFR-2 FGFR2 Fibroblast growth factor receptor 2 (FGFR2) KGFR Keratinocyte growth factor receptor VEGF-receptor 2 and Fibroblast growth factor receptor 2
Type:
Enzyme
Mol. Mass.:
92015.45
Organism:
Homo sapiens (Human)
Description:
P21802
Residue:
821
  
Inhibitor
Name:
BDBM357698
Synonyms:
N-((3-(2,6-difluoro-3,5-dimethoxyphenyl)-1-ethyl-2-oxo-1,2,3,4-tetrahydropyrido[4,3-d]pyrimidin-7-yl)methyl)acrylamide US10738048, Example 2 US11667635, Example 2 | US9890156, Example 2
Type:
Small organic molecule
Emp. Form.:
C21H22F2N4O4
Mol. Mass.:
432.4206
SMILES:
CCN1C(=O)N(Cc2cnc(CNC(=O)C=C)cc12)c1c(F)c(OC)cc(OC)c1F
: