Target
Fibroblast growth factor receptor 1
Ligand
BDBM357710
Substrate
Meas. Tech.
TBD
IC50
>200±n/a nM
Citation
 Lu, LWu, LQian, DYao, W Bicyclic heterocycles as FGFR4 inhibitors US Patent  US10214528 Publication Date 2/26/2019 
Target
Name:
Fibroblast growth factor receptor 1
Synonyms:
BFGFR Basic fibroblast growth factor receptor 1 (FGFR1) CEK FGFR-1 FGFR-1, (FL) FGFR1_HUMAN FLT2 Fibroblast growth factor receptor 1 (FGFR-1) Fms-like tyrosine kinase 2 N-sam bFGF-R | c-fgr
Type:
Receptor
Mol. Mass.:
91861.70
Organism:
Homo sapiens (Human)
Description:
P11362
Residue:
822
  
Inhibitor
Name:
BDBM357710
Synonyms:
N-((3-(2,6-difluoro-3,5-dimethoxyphenyl)-1-(2,2-difluoroethyl)-2-oxo-1,2,3,4-tetrahydropyrido[4,3-d]pyrimidin-7-yl)methyl)acrylamide US10738048, Example 14 US11667635, Example 14 | US9890156, Example 14
Type:
Small organic molecule
Emp. Form.:
C21H20F4N4O4
Mol. Mass.:
468.4015
SMILES:
COc1cc(OC)c(F)c(N2Cc3cnc(CNC(=O)C=C)cc3N(CC(F)F)C2=O)c1F
: