Target
Fibroblast growth factor receptor 2
Ligand
BDBM357725
Substrate
Meas. Tech.
TBD
IC50
115±n/a nM
Citation
 Lu, LWu, LQian, DYao, W Bicyclic heterocycles as FGFR4 inhibitors US Patent  US10214528 Publication Date 2/26/2019 
Target
Name:
Fibroblast growth factor receptor 2
Synonyms:
BEK FGFR-2 FGFR2 Fibroblast growth factor receptor 2 (FGFR2) KGFR Keratinocyte growth factor receptor VEGF-receptor 2 and Fibroblast growth factor receptor 2
Type:
Enzyme
Mol. Mass.:
92015.45
Organism:
Homo sapiens (Human)
Description:
P21802
Residue:
821
  
Inhibitor
Name:
BDBM357725
Synonyms:
N-((3-(2,6-difluoro-3,5-dimethoxyphenyl)-1-isobutyl-2-oxo-1,2,3,4-tetrahydropyrido[4,3-d]pyrimidin-7-yl)methyl)acrylamide US10738048, Example 29 US11667635, Example 29 | US9890156, Example 29
Type:
Small organic molecule
Emp. Form.:
C23H26F2N4O4
Mol. Mass.:
460.4737
SMILES:
COc1cc(OC)c(F)c(N2Cc3cnc(CNC(=O)C=C)cc3N(CC(C)C)C2=O)c1F
: