Target
Fibroblast growth factor receptor 4
Ligand
BDBM357726
Substrate
Meas. Tech.
TBD
IC50
<10±n/a nM
Citation
 Lu, LWu, LQian, DYao, W Bicyclic heterocycles as FGFR4 inhibitors US Patent  US10214528 Publication Date 2/26/2019 
Target
Name:
Fibroblast growth factor receptor 4
Synonyms:
CD_antigen: CD334 FGFR4 FGFR4 Fibroblast growth factor receptor JK2 TKF
Type:
Protein
Mol. Mass.:
87957.45
Organism:
Homo sapiens (Human)
Description:
P22455
Residue:
802
  
Inhibitor
Name:
BDBM357726
Synonyms:
N-((1-(cyclobutylmethyl)-3-(2,6-difluoro-3,5-dimethoxyphenyl)-2-oxo-1,2,3,4-tetrahydropyrido[4,3-d]pyrimidin-7-yl)methyl)acrylamide US10738048, Example 30 US11667635, Example 30 | US9890156, Example 30
Type:
Small organic molecule
Emp. Form.:
C24H26F2N4O4
Mol. Mass.:
472.4844
SMILES:
COc1cc(OC)c(F)c(N2Cc3cnc(CNC(=O)C=C)cc3N(CC3CCC3)C2=O)c1F
: