Target
Tryptophan 5-hydroxylase 1
Ligand
BDBM357762
Substrate
Meas. Tech.
In Vitro Enzyme Activity Assay
IC50
7400±n/a nM
Citation
 Bader, MSpecker, EMatthes, SSchütz, AMallow, KGrohmann, MNazaré, M Xanthine derivatives, their use as a medicament, and pharmaceutical preparations comprising the same US Patent  US10214530 Publication Date 2/26/2019 
Target
Name:
Tryptophan 5-hydroxylase 1
Synonyms:
TPH TPH1_HUMAN TRPH | Tryptophan 5-monooxygenase 1
Type:
PROTEIN
Mol. Mass.:
50990.64
Organism:
Homo sapiens (Human)
Description:
ChEMBL_1361824
Residue:
444
  
Inhibitor
Name:
BDBM357762
Synonyms:
KM430/(I-31) | US10214530, Example 37
Type:
Small organic molecule
Emp. Form.:
C20H17N7O2S
Mol. Mass.:
419.46
SMILES:
Cn1c2nc(Sc3nc4cc(N)ccc4[nH]3)n(Cc3ccccc3)c2c(=O)[nH]c1=O
: