Target
Tryptophan 5-hydroxylase 1
Ligand
BDBM357778
Substrate
Meas. Tech.
In Vitro Enzyme Activity Assay
IC50
>200000±n/a nM
Citation
 Bader, MSpecker, EMatthes, SSchütz, AMallow, KGrohmann, MNazaré, M Xanthine derivatives, their use as a medicament, and pharmaceutical preparations comprising the same US Patent  US10214530 Publication Date 2/26/2019 
Target
Name:
Tryptophan 5-hydroxylase 1
Synonyms:
TPH TPH1_HUMAN TRPH | Tryptophan 5-monooxygenase 1
Type:
PROTEIN
Mol. Mass.:
50990.64
Organism:
Homo sapiens (Human)
Description:
ChEMBL_1361824
Residue:
444
  
Inhibitor
Name:
BDBM357778
Synonyms:
KM423/(I-26) | US10214530, Example 32
Type:
Small organic molecule
Emp. Form.:
C22H20N6O2S
Mol. Mass.:
432.498
SMILES:
CCn1c(Sc2nc3n(C)c(=O)[nH]c(=O)c3n2Cc2ccccc2)nc2ccccc12
: