Target
Tryptophan 5-hydroxylase 1
Ligand
BDBM357789
Substrate
Meas. Tech.
In Vitro Enzyme Activity Assay
IC50
>200000±n/a nM
Citation
 Bader, MSpecker, EMatthes, SSchütz, AMallow, KGrohmann, MNazaré, M Xanthine derivatives, their use as a medicament, and pharmaceutical preparations comprising the same US Patent  US10214530 Publication Date 2/26/2019 
Target
Name:
Tryptophan 5-hydroxylase 1
Synonyms:
TPH TPH1_HUMAN TRPH | Tryptophan 5-monooxygenase 1
Type:
PROTEIN
Mol. Mass.:
50990.64
Organism:
Homo sapiens (Human)
Description:
ChEMBL_1361824
Residue:
444
  
Inhibitor
Name:
BDBM357789
Synonyms:
MW-01-162/(I-303) | US10214530, Example 56
Type:
Small organic molecule
Emp. Form.:
C22H21N7O2
Mol. Mass.:
415.4478
SMILES:
CCCn1c2nc(Nc3nc4ccccc4[nH]3)n(Cc3ccccc3)c2c(=O)[nH]c1=O
: