Target
Tryptophan 5-hydroxylase 2
Ligand
BDBM357738
Substrate
Meas. Tech.
In Vitro Enzyme Activity Assay
IC50
60.0±n/a nM
Citation
 Bader, MSpecker, EMatthes, SSchütz, AMallow, KGrohmann, MNazaré, M Xanthine derivatives, their use as a medicament, and pharmaceutical preparations comprising the same US Patent  US10214530 Publication Date 2/26/2019 
Target
Name:
Tryptophan 5-hydroxylase 2
Synonyms:
NTPH TPH2_HUMAN
Type:
PROTEIN
Mol. Mass.:
56055.12
Organism:
Homo sapiens (Human)
Description:
ChEMBL_487490
Residue:
490
  
Inhibitor
Name:
BDBM357738
Synonyms:
KM-05-130/(I-19) | US10214530, Example 19
Type:
Small organic molecule
Emp. Form.:
C23H20N6O3
Mol. Mass.:
428.4433
SMILES:
Oc1ccc2nc(Cc3nc4n(C5CC5)c(=O)[nH]c(=O)c4n3Cc3ccccc3)[nH]c2c1
: