Target
Tryptophan 5-hydroxylase 2
Ligand
BDBM357787
Substrate
Meas. Tech.
In Vitro Enzyme Activity Assay
IC50
>200000±n/a nM
Citation
 Bader, MSpecker, EMatthes, SSchütz, AMallow, KGrohmann, MNazaré, M Xanthine derivatives, their use as a medicament, and pharmaceutical preparations comprising the same US Patent  US10214530 Publication Date 2/26/2019 
Target
Name:
Tryptophan 5-hydroxylase 2
Synonyms:
NTPH TPH2_HUMAN
Type:
PROTEIN
Mol. Mass.:
56055.12
Organism:
Homo sapiens (Human)
Description:
ChEMBL_487490
Residue:
490
  
Inhibitor
Name:
BDBM357787
Synonyms:
KM-05-145/(I-301) | US10214530, Example 54
Type:
Small organic molecule
Emp. Form.:
C20H17N7O2
Mol. Mass.:
387.3947
SMILES:
Cn1c2nc(Nc3nc4ccccc4[nH]3)n(Cc3ccccc3)c2c(=O)[nH]c1=O
: