Target
Genome polyprotein
Ligand
BDBM357831
Substrate
Meas. Tech.
HCV Replicon Luciferase Assay
EC50
>1000±n/a nM
Citation
 Wang, TZhang, ZParcella, KEEastman, KJKadow, JF Substituted 2-phenyl (AZA)benzofuran compounds for the treatment of hepatitis C US Patent  US10214534 Publication Date 2/26/2019 
Target
Name:
Genome polyprotein
Synonyms:
HCV Polymerase (S282T) NS3/4A Protein POLG_HCVJA
Type:
Protein
Mol. Mass.:
327076.78
Organism:
Hepatitis C Virus (Virus)
Description:
P26662
Residue:
3010
  
Inhibitor
Name:
BDBM357831
Synonyms:
US10214534, Compound 2013
Type:
Small organic molecule
Emp. Form.:
C36H32F3N3O6
Mol. Mass.:
659.651
SMILES:
CNC(=O)c1c(oc2nc(CCC(F)(F)F)c(cc12)-c1cccc(c1)C(=O)NC(C)(C)C)-c1ccc(Oc2ccc(cc2)C(O)=O)cc1
: