Target
Genome polyprotein
Ligand
BDBM357836
Substrate
Meas. Tech.
HCV Replicon Luciferase Assay
EC50
9.40±n/a nM
Citation
 Wang, TZhang, ZParcella, KEEastman, KJKadow, JF Substituted 2-phenyl (AZA)benzofuran compounds for the treatment of hepatitis C US Patent  US10214534 Publication Date 2/26/2019 
Target
Name:
Genome polyprotein
Synonyms:
HCV Polymerase (S282T) NS3/4A Protein POLG_HCVJA
Type:
Protein
Mol. Mass.:
327076.78
Organism:
Hepatitis C Virus (Virus)
Description:
P26662
Residue:
3010
  
Inhibitor
Name:
BDBM357836
Synonyms:
Step 1: Preparation of 5-bromo-6-chloro-3-((4-chlorophenyl)ethynyl)pyridin-2-yl acetate | US10214534, Compound 4002
Type:
Small organic molecule
Emp. Form.:
C30H31F4N5O3
Mol. Mass.:
585.5925
SMILES:
CNC(=O)c1c(oc2nc(NCC(F)F)c(cc12)-c1cccc(c1)C(=O)NC(C)(C)C)-c1ccc(NCC(F)F)cc1
: