Target
Orexin/Hypocretin receptor type 1
Ligand
BDBM357849
Substrate
Meas. Tech.
FLIPR Ca2+ Flux Assay
IC50
9892±n/a nM
Citation
 Kuduk, SDLiverton, NLuo, Y Hydroxmethyl piperidine orexin receptor antagonists US Patent  US10214535 Publication Date 2/26/2019 
Target
Name:
Orexin/Hypocretin receptor type 1
Synonyms:
HCRTR1 OX1R_HUMAN Orexin receptor type 1 (OR 1) Orexin receptor type 1 (OX1) Orexin receptor type 1 (OxR1) | Ox1r
Type:
Protein
Mol. Mass.:
47554.50
Organism:
Homo sapiens (Human)
Description:
O43613
Residue:
425
  
Inhibitor
Name:
BDBM357849
Synonyms:
US10214535, Example 9 | [(2S,5R)-5-[(4-methylpyridin- 2-yl)oxy]-1-{[2-(2H-1,2,3- triazol-2-yl)phenyl]carbonyl} piperidin-2-yl]methanol
Type:
Small organic molecule
Emp. Form.:
C21H23N5O4
Mol. Mass.:
409.4384
SMILES:
COc1ccnc(O[C@@H]2CC[C@@H](CO)N(C2)C(=O)c2ccccc2-n2nccn2)c1
: