Target
Serine/threonine-protein kinase TBK1
Ligand
BDBM357875
Substrate
Meas. Tech.
Kinase Assays
IC50
3830±n/a nM
Citation
 Showalter, HDSaltiel, ARTesmer, JJGan, X Amlexanox analogs US Patent  US10214536 Publication Date 2/26/2019 
Target
Name:
Serine/threonine-protein kinase TBK1
Synonyms:
NAK Protein cereblon/Serine/threonine-protein kinase TBK1 TANK-binding kinase 1 (TBK-1) TBK1 | TBK1_HUMAN
Type:
protein
Mol. Mass.:
83645.20
Organism:
Homo sapiens (Human)
Description:
Q9UHD2
Residue:
729
  
Inhibitor
Name:
BDBM357875
Synonyms:
US10214536, Compound 51
Type:
Small organic molecule
Emp. Form.:
C20H20N2O4
Mol. Mass.:
352.3838
SMILES:
CC1CCC(CC1)c1ccc2oc3nc(N)c(cc3c(=O)c2c1)C(O)=O
: