Target
Serine/threonine-protein kinase TBK1
Ligand
BDBM357878
Substrate
Meas. Tech.
Kinase Assays
IC50
2840±n/a nM
Citation
 Showalter, HDSaltiel, ARTesmer, JJGan, X Amlexanox analogs US Patent  US10214536 Publication Date 2/26/2019 
Target
Name:
Serine/threonine-protein kinase TBK1
Synonyms:
NAK Protein cereblon/Serine/threonine-protein kinase TBK1 TANK-binding kinase 1 (TBK-1) TBK1 | TBK1_HUMAN
Type:
protein
Mol. Mass.:
83645.20
Organism:
Homo sapiens (Human)
Description:
Q9UHD2
Residue:
729
  
Inhibitor
Name:
BDBM357878
Synonyms:
US10214536, Compound 55a
Type:
Small organic molecule
Emp. Form.:
C21H20N2O4
Mol. Mass.:
364.3945
SMILES:
Nc1nc2oc3ccc(\C=C\C4CCCCC4)cc3c(=O)c2cc1C(O)=O
: