Target
Serine/threonine-protein kinase TBK1
Ligand
BDBM357902
Substrate
Meas. Tech.
Kinase Assays
IC50
3980±n/a nM
Citation
 Showalter, HDSaltiel, ARTesmer, JJGan, X Amlexanox analogs US Patent  US10214536 Publication Date 2/26/2019 
Target
Name:
Serine/threonine-protein kinase TBK1
Synonyms:
NAK Protein cereblon/Serine/threonine-protein kinase TBK1 TANK-binding kinase 1 (TBK-1) TBK1 | TBK1_HUMAN
Type:
protein
Mol. Mass.:
83645.20
Organism:
Homo sapiens (Human)
Description:
Q9UHD2
Residue:
729
  
Inhibitor
Name:
BDBM357902
Synonyms:
2-Amino-7-(cyclopropylethynyl)-5-oxo-5H-chromeno[2,3-b]pyridine-3-carboxylic acid | US10214536, Compound 241c
Type:
Small organic molecule
Emp. Form.:
C18H12N2O4
Mol. Mass.:
320.2989
SMILES:
Nc1nc2oc3ccc(cc3c(=O)c2cc1C(O)=O)C#CC1CC1
: