Target
Serine/threonine-protein kinase TBK1
Ligand
BDBM357916
Substrate
Meas. Tech.
Kinase Assays
IC50
19500±n/a nM
Citation
 Showalter, HDSaltiel, ARTesmer, JJGan, X Amlexanox analogs US Patent  US10214536 Publication Date 2/26/2019 
Target
Name:
Serine/threonine-protein kinase TBK1
Synonyms:
NAK Protein cereblon/Serine/threonine-protein kinase TBK1 TANK-binding kinase 1 (TBK-1) TBK1 | TBK1_HUMAN
Type:
protein
Mol. Mass.:
83645.20
Organism:
Homo sapiens (Human)
Description:
Q9UHD2
Residue:
729
  
Inhibitor
Name:
BDBM357916
Synonyms:
US10214536, Compound 282
Type:
Small organic molecule
Emp. Form.:
C17H17N3O3
Mol. Mass.:
311.3352
SMILES:
CNC(=O)c1cc2c(nc1N)oc1ccc(cc1c2=O)C(C)C
: