Target
Serine/threonine-protein kinase TBK1
Ligand
BDBM357932
Substrate
Meas. Tech.
Kinase Assays
IC50
1530±n/a nM
Citation
 Showalter, HDSaltiel, ARTesmer, JJGan, X Amlexanox analogs US Patent  US10214536 Publication Date 2/26/2019 
Target
Name:
Serine/threonine-protein kinase TBK1
Synonyms:
NAK Protein cereblon/Serine/threonine-protein kinase TBK1 TANK-binding kinase 1 (TBK-1) TBK1 | TBK1_HUMAN
Type:
protein
Mol. Mass.:
83645.20
Organism:
Homo sapiens (Human)
Description:
Q9UHD2
Residue:
729
  
Inhibitor
Name:
BDBM357932
Synonyms:
US10214536, Compound 299
Type:
Small organic molecule
Emp. Form.:
C16H12N2O4
Mol. Mass.:
296.2775
SMILES:
CC(=C)c1ccc2oc3nc(N)c(cc3c(=O)c2c1)C(O)=O
: