Target
Prostaglandin D2 receptor 2
Ligand
BDBM230040
Substrate
Meas. Tech.
Binding Inhibition Assay (1% HSA)
pH
7.4±n/a
Temperature
298.15±n/a K
EC50
16.0±n/a nM
Comments
extracted
Citation
 Burgess, LEClark, CTCook, ACorrette, CPDeLisle, RKDoherty, GAHunt, KWRomoff, TTKim, G 6-substituted phenoxychroman carboxylic acid derivatives US Patent  US9556139 Publication Date 1/31/2017 
Target
Name:
Prostaglandin D2 receptor 2
Synonyms:
CD_antigen=CD294 Chemoattractant Receptor-homologous molecule expressed on T-helper type 2 cells (CRTH2) Chemoattractant receptor-homologous molecule expressed on Th2 cells (CRTH2) G protein-coupled receptor 44 GPR44 PTGDR2 Prostaglandin D2 receptor 2 | Prostaglandin D2 receptor 2 (PGD2)
Type:
Enzyme
Mol. Mass.:
43295.45
Organism:
Homo sapiens (Human)
Description:
Q9Y5Y4
Residue:
395
  
Inhibitor
Name:
BDBM230040
Synonyms:
2-(4-Chloro-2-methoxyphenyl)ethanamine | US9556139, 8
Type:
Small organic molecule
Emp. Form.:
C24H16Cl2N2O5
Mol. Mass.:
483.3
SMILES:
OC(=O)C1CCOc2cc(Oc3ccc(cc3)C(=O)Nc3ccc(Cl)c(Cl)c3)c(cc12)C#N
: