Target
Prostaglandin D2 receptor 2
Ligand
BDBM230643
Substrate
Meas. Tech.
Binding Inhibition Assay (1% HSA)
pH
7.4±n/a
Temperature
298.15±n/a K
EC50
12.1±n/a nM
Comments
extracted
Citation
 Burgess, LEClark, CTCook, ACorrette, CPDeLisle, RKDoherty, GAHunt, KWRomoff, TTKim, G 6-substituted phenoxychroman carboxylic acid derivatives US Patent  US9556139 Publication Date 1/31/2017 
Target
Name:
Prostaglandin D2 receptor 2
Synonyms:
CD_antigen=CD294 Chemoattractant Receptor-homologous molecule expressed on T-helper type 2 cells (CRTH2) Chemoattractant receptor-homologous molecule expressed on Th2 cells (CRTH2) G protein-coupled receptor 44 GPR44 PTGDR2 Prostaglandin D2 receptor 2 | Prostaglandin D2 receptor 2 (PGD2)
Type:
Enzyme
Mol. Mass.:
43295.45
Organism:
Homo sapiens (Human)
Description:
Q9Y5Y4
Residue:
395
  
Inhibitor
Name:
BDBM230643
Synonyms:
6-Cyano-7-(4-(2-(naphthalen-1-yl)ethylcarbamoyl)phenoxy)chroman-4-carboxylic acid | US9556139, 55
Type:
Small organic molecule
Emp. Form.:
C30H24N2O5
Mol. Mass.:
492.522
SMILES:
OC(=O)C1CCOc2cc(Oc3ccc(cc3)C(=O)NCCc3cccc4ccccc34)c(cc12)C#N
: