Target
Prostaglandin D2 receptor 2
Ligand
BDBM233357
Substrate
Meas. Tech.
Binding Inhibition Assay (4% HSA)
pH
7.4±n/a
Temperature
298.15±n/a K
EC50
723±n/a nM
Comments
extracted
Citation
 Burgess, LEClark, CTCook, ACorrette, CPDeLisle, RKDoherty, GAHunt, KWRomoff, TTKim, G 6-substituted phenoxychroman carboxylic acid derivatives US Patent  US9556139 Publication Date 1/31/2017 
Target
Name:
Prostaglandin D2 receptor 2
Synonyms:
CD_antigen=CD294 Chemoattractant Receptor-homologous molecule expressed on T-helper type 2 cells (CRTH2) Chemoattractant receptor-homologous molecule expressed on Th2 cells (CRTH2) G protein-coupled receptor 44 GPR44 PTGDR2 Prostaglandin D2 receptor 2 | Prostaglandin D2 receptor 2 (PGD2)
Type:
Enzyme
Mol. Mass.:
43295.45
Organism:
Homo sapiens (Human)
Description:
Q9Y5Y4
Residue:
395
  
Inhibitor
Name:
BDBM233357
Synonyms:
Sodium 6-chloro-7-(4-(3-(4-methoxyphenyl)cyclopentylcarbamoyl)phenoxy)chroman-4-carboxylate | US9556139, 174
Type:
Small organic molecule
Emp. Form.:
C29H28ClNO6
Mol. Mass.:
521.989
SMILES:
COc1ccc(cc1)C1CCC(C1)NC(=O)c1ccc(Oc2cc3OCCC(C(O)=O)c3cc2Cl)cc1
: