Target
Renin
Ligand
BDBM18269
Substrate
tetradecapeptide substrate, TDP
Meas. Tech.
In Vitro Enzyme Inhibition
pH
7.2±n/a
Temperature
310.15±n/a K
IC50
6±n/a nM
Citation
 Göschke, RStutz, SRasetti, VCohen, NCRahuel, JRigollier, PBaum, HPForgiarini, PSchnell, CRWagner, TGruetter, MGFuhrer, WSchilling, WCumin, FWood, JMMaibaum, J Novel 2,7-Dialkyl-Substituted 5(S)-Amino-4(S)-hydroxy-8-phenyl-octanecarboxamide Transition State Peptidomimetics Are Potent and Orally Active Inhibitors of Human Renin. J Med Chem 50:4818-31 (2007)  
Target
Name:
Renin
Synonyms:
Angiotensinogenase RENI_HUMAN
Type:
Enzyme
Mol. Mass.:
45058.99
Organism:
Homo sapiens (Human)
Description:
Residue:
406
  
Inhibitor
Name:
BDBM18269
Synonyms:
8-phenyl-octanecarboxamide peptidomimetic, 27 | methyl 2-{5-[(2S,4S,5S,7R)-4-amino-7-(butylcarbamoyl)-5-hydroxy-7-methyl-2-(propan-2-yl)heptyl]-2-tert-butylphenoxy}acetate
Type:
Small organic molecule
Emp. Form.:
C29H50N2O5
Mol. Mass.:
506.7177
SMILES:
CCCCNC(=O)[C@H](C)C[C@H](O)[C@@H](N)C[C@H](Cc1ccc(c(OCC(=O)OC)c1)C(C)(C)C)C(C)C
:
Substrate
Name:
tetradecapeptide substrate, TDP
Synonyms:
Type:
Peptide
Mol. Mass.:
4775.39
Organism:
Description:
Residue:
42