Target
Renin
Ligand
BDBM18288
Substrate
tetradecapeptide substrate, TDP
Meas. Tech.
In Vitro Enzyme Inhibition
pH
7.2±n/a
Temperature
310.15±n/a K
IC50
0.4±n/a nM
Citation
 Göschke, RStutz, SRasetti, VCohen, NCRahuel, JRigollier, PBaum, HPForgiarini, PSchnell, CRWagner, TGruetter, MGFuhrer, WSchilling, WCumin, FWood, JMMaibaum, J Novel 2,7-Dialkyl-Substituted 5(S)-Amino-4(S)-hydroxy-8-phenyl-octanecarboxamide Transition State Peptidomimetics Are Potent and Orally Active Inhibitors of Human Renin. J Med Chem 50:4818-31 (2007)  
Target
Name:
Renin
Synonyms:
Angiotensinogenase RENI_HUMAN
Type:
Enzyme
Mol. Mass.:
45058.99
Organism:
Homo sapiens (Human)
Description:
Residue:
406
  
Inhibitor
Name:
BDBM18288
Synonyms:
(2R,4S,5S,7S)-5-amino-4-hydroxy-7-{[4-methoxy-3-(3-methoxypropoxy)phenyl]methyl}-N-(3-methoxypropyl)-2,8-dimethylnonanamide | 8-phenyl-octanecarboxamide peptidomimetic, 45
Type:
Small organic molecule
Emp. Form.:
C27H48N2O6
Mol. Mass.:
496.6798
SMILES:
COCCCNC(=O)[C@H](C)C[C@H](O)[C@@H](N)C[C@H](Cc1ccc(OC)c(OCCCOC)c1)C(C)C
:
Substrate
Name:
tetradecapeptide substrate, TDP
Synonyms:
Type:
Peptide
Mol. Mass.:
4775.39
Organism:
Description:
Residue:
42