Target
Proteinase-activated receptor 4
Ligand
BDBM358813
Substrate
Meas. Tech.
FLIPR Assay in PAR4-Expressing HEK293 Cells
EC50
2.90±n/a nM
Citation
 Banville, J Imidazopyridazine and imidazothiadiazole compounds US Patent  US10214544 Publication Date 2/26/2019 
Target
Name:
Proteinase-activated receptor 4
Synonyms:
Coagulation factor II receptor-like 3 PAR-4 PAR4_HUMAN Proteinase-activated receptor 4 (PAR4) | Thrombin receptor-like 3
Type:
Protein
Mol. Mass.:
41145.16
Organism:
Homo sapiens (Human)
Description:
Q96RI0
Residue:
385
  
Inhibitor
Name:
BDBM358813
Synonyms:
US10214544, Example 127
Type:
Small organic molecule
Emp. Form.:
C30H25N5O6S
Mol. Mass.:
583.614
SMILES:
COc1nn2cc(nc2s1)-c1cc2c(OCc3cccc4N(CCc34)C(=O)c3ccc(OC)nc3)cc(OC)cc2o1
: