Target
Proteinase-activated receptor 4
Ligand
BDBM358846
Substrate
Meas. Tech.
FLIPR Assay in PAR4-Expressing HEK293 Cells
EC50
1.50±n/a nM
Citation
 Banville, J Imidazopyridazine and imidazothiadiazole compounds US Patent  US10214544 Publication Date 2/26/2019 
Target
Name:
Proteinase-activated receptor 4
Synonyms:
Coagulation factor II receptor-like 3 PAR-4 PAR4_HUMAN Proteinase-activated receptor 4 (PAR4) | Thrombin receptor-like 3
Type:
Protein
Mol. Mass.:
41145.16
Organism:
Homo sapiens (Human)
Description:
Q96RI0
Residue:
385
  
Inhibitor
Name:
BDBM358846
Synonyms:
US10214544, Example 161
Type:
Small organic molecule
Emp. Form.:
C29H20F4N4O5S
Mol. Mass.:
612.552
SMILES:
COc1nn2cc(nc2s1)-c1cc2c(OCc3cccc(NC(=O)c4ccc(c(F)c4)C(F)(F)F)c3)cc(OC)cc2o1
: