Target
Renin
Ligand
BDBM18331
Substrate
tetradecapeptide substrate, TDP
Meas. Tech.
In Vitro Enzyme Inhibition
pH
7.2±n/a
Temperature
310.15±n/a K
IC50
1±n/a nM
Citation
 Maibaum, JStutz, SGöschke, RRigollier, PYamaguchi, YCumin, FRahuel, JBaum, HPCohen, NCSchnell, CRFuhrer, WGruetter, MGSchilling, WWood, JM Structural Modification of the P2' Position of 2,7-Dialkyl-Substituted 5(S)-Amino-4(S)-hydroxy-8-phenyl-octanecarboxamides: The Discovery of Aliskiren, a Potent Nonpeptide Human Renin Inhibitor Active after Once Daily Dosing in Marmosets. J Med Chem 50:4832-44 (2007)  
Target
Name:
Renin
Synonyms:
Angiotensinogenase RENI_HUMAN
Type:
Enzyme
Mol. Mass.:
45058.99
Organism:
Homo sapiens (Human)
Description:
Residue:
406
  
Inhibitor
Name:
BDBM18331
Synonyms:
(2S,4S,5S,7S)-5-amino-N-[(2S)-1-carbamoylpropan-2-yl]-4-hydroxy-7-{[4-methoxy-3-(3-methoxypropoxy)phenyl]methyl}-8-methyl-2-(propan-2-yl)nonanamide | 2,7-dialkyl-substituted 8-phenyl-octanecarboxamide, 40
Type:
Small organic molecule
Emp. Form.:
C29H51N3O6
Mol. Mass.:
537.7317
SMILES:
COCCCOc1cc(C[C@@H](C[C@H](N)[C@@H](O)C[C@@H](C(C)C)C(=O)N[C@@H](C)CC(N)=O)C(C)C)ccc1OC
:
Substrate
Name:
tetradecapeptide substrate, TDP
Synonyms:
Type:
Peptide
Mol. Mass.:
4775.39
Organism:
Description:
Residue:
42