Target
Renin
Ligand
BDBM18338
Substrate
tetradecapeptide substrate, TDP
Meas. Tech.
In Vitro Enzyme Inhibition
IC50
0.8±n/a nM
Citation
 Maibaum, JStutz, SGöschke, RRigollier, PYamaguchi, YCumin, FRahuel, JBaum, HPCohen, NCSchnell, CRFuhrer, WGruetter, MGSchilling, WWood, JM Structural Modification of the P2' Position of 2,7-Dialkyl-Substituted 5(S)-Amino-4(S)-hydroxy-8-phenyl-octanecarboxamides: The Discovery of Aliskiren, a Potent Nonpeptide Human Renin Inhibitor Active after Once Daily Dosing in Marmosets. J Med Chem 50:4832-44 (2007)  
Target
Name:
Renin
Synonyms:
Angiotensinogenase RENI_HUMAN
Type:
Enzyme
Mol. Mass.:
45058.99
Organism:
Homo sapiens (Human)
Description:
Residue:
406
  
Inhibitor
Name:
BDBM18338
Synonyms:
(2S,4S,5S,7S)-5-amino-4-hydroxy-7-{[4-methoxy-3-(3-methoxypropoxy)phenyl]methyl}-8-methyl-N-[3-(methylcarbamoyl)propyl]-2-(propan-2-yl)nonanamide | 2,7-dialkyl-substituted 8-phenyl-octanecarboxamide, 48
Type:
Small organic molecule
Emp. Form.:
C30H53N3O6
Mol. Mass.:
551.7583
SMILES:
CNC(=O)CCCNC(=O)[C@@H](C[C@H](O)[C@@H](N)C[C@H](Cc1ccc(OC)c(OCCCOC)c1)C(C)C)C(C)C
:
Substrate
Name:
tetradecapeptide substrate, TDP
Synonyms:
Type:
Peptide
Mol. Mass.:
4775.39
Organism:
Description:
Residue:
42