Target
Isoform 2 of MAP kinase-interacting serine/threonine-protein kinase 1 (MNK1a)
Ligand
BDBM358858
Substrate
Meas. Tech.
MKNK1 Kinase Assay
IC50
2.80±n/a nM
Citation
 Schulze, VEis, KPuehler, FZorn, LSülzle, DLienau, PWengner, AMPetersen, KBömer, U Amido-substituted imidazopyridazines useful in the treatment of hyper-proliferative and/or angiogenesis disorders US Patent  US10214545 Publication Date 2/26/2019 
Target
Name:
Isoform 2 of MAP kinase-interacting serine/threonine-protein kinase 1 (MNK1a)
Synonyms:
MAP Kinase interacting Kinase MKNK1 MNK1
Type:
Serine/threonine-protein kinase
Mol. Mass.:
47403.02
Organism:
Homo sapiens (Human)
Description:
BAA19885
Residue:
424
  
Inhibitor
Name:
BDBM358858
Synonyms:
N-[(2R)-1-hydroxypropan-2-yl]-3-[4-(morpholin-4-yl)furo[3,2-c]pyridin-2-yl]-imidazo[1,2-b]pyridazine-6-carboxamide | US10214545, Example 7
Type:
Small organic molecule
Emp. Form.:
C21H22N6O4
Mol. Mass.:
422.4372
SMILES:
C[C@H](CO)NC(=O)c1ccc2ncc(-c3cc4c(nccc4o3)N3CCOCC3)n2n1
: