Target
Protein-lysine 6-oxidase
Ligand
BDBM18361
Substrate
BDBM18365
Meas. Tech.
In Vitro Enzyme Inhibition
pH
4.5±n/a
Temperature
310.15±n/a K
IC50
31000±n/a nM
Citation
 Yu, LIkeda, KKato, AAdachi, IGodin, GCompain, PMartin, OAsano, N Alpha-1-C-octyl-1-deoxynojirimycin as a pharmacological chaperone for Gaucher disease. Bioorg Med Chem 14:7736-44 (2006)  
Target
Name:
Protein-lysine 6-oxidase
Synonyms:
LOX Lysyl oxidase | alpha-Glucosidase (alpha-Glu)
Type:
PROTEIN
Mol. Mass.:
46954.13
Organism:
Homo sapiens (Human)
Description:
ChEMBL_306619
Residue:
417
  
Inhibitor
Name:
BDBM18361
Synonyms:
(2R,3S,4R,5R,6R)-2-butyl-6-(hydroxymethyl)piperidine-3,4,5-triol | alpha-1-C-Butyl-DNJ
Type:
Small organic molecule
Emp. Form.:
C10H21NO4
Mol. Mass.:
219.278
SMILES:
CCCC[C@H]1N[C@H](CO)[C@@H](O)[C@H](O)[C@H]1O
:
Substrate
Name:
BDBM18365
Synonyms:
4-Methylumbelliferyl alpha-D-glucopyranoside 4-methylumbelliferyl alpha-glucoside
Type:
Small organic molecule
Emp. Form.:
C16H18O8
Mol. Mass.:
338.3093
SMILES:
Cc1cc(=O)oc2cc(O[C@H]3O[C@H](CO)[C@@H](O)[C@H](O)[C@H]3O)ccc12
: