Target
Lysosomal acid glucosylceramidase
Ligand
BDBM18370
Substrate
BDBM18352
Meas. Tech.
IC50 Measurements
pH
5±n/a
Temperature
310.15±n/a K
IC50
11000±n/a nM
Citation
 Yu, ZSawkar, ARWhalen, LJWong, CHKelly, JW Isofagomine- and 2,5-anhydro-2,5-imino-D-glucitol-based glucocerebrosidase pharmacological chaperones for Gaucher disease intervention. J Med Chem 50:94-100 (2007)  
Target
Name:
Lysosomal acid glucosylceramidase
Synonyms:
Acid beta-glucosidase Beta-glucocerebrosidase D-glucosyl-N-acylsphingosine glucohydrolase GBA1 GC GLUC Glucosylceramidase (GBA) Glucosylceramidase precursor (Beta-glucocerebrosidase) (Acid beta-glucosidase) (D-glucosyl-N-acylsphingosine glucohydrolase) (Alglucerase) (Imiglucerase) beta-glucocerebrosidase (GCase)
Type:
Enzyme
Mol. Mass.:
59724.64
Organism:
Homo sapiens (Human)
Description:
The beta-Glu activity was measured with commercially available beta-glucocerebrosidase (Ceredase) as the enzyme source.
Residue:
536
  
Inhibitor
Name:
BDBM18370
Synonyms:
N-(adamantan-1-yl)-5-[(3R,4R,5R)-3,4-dihydroxy-5-(hydroxymethyl)piperidin-1-yl]pentanamide | isofagomine-based compound, 4
Type:
Small organic molecule
Emp. Form.:
C21H36N2O4
Mol. Mass.:
380.5215
SMILES:
OC[C@H]1CN(CCCCC(=O)NC23CC4CC(CC(C4)C2)C3)C[C@@H](O)[C@@H]1O
:
Substrate
Name:
BDBM18352
Synonyms:
4-Methylumbelliferyl beta-D-glucopyranoside 4-methylumbelliferyl beta-D-glucoside | MUD
Type:
Small organic molecule
Emp. Form.:
C16H18O8
Mol. Mass.:
338.3093
SMILES:
Cc1cc(=O)oc2cc(O[C@@H]3O[C@H](CO)[C@@H](O)[C@H](O)[C@H]3O)ccc12
: