Target
Tyrosine-protein kinase BTK
Ligand
BDBM358944
Substrate
Meas. Tech.
Btk Enzyme Activity Assay
IC50
0.210±n/a nM
Citation
 Liu, JKozlowski, JABoga, SBGao, XGuiadeen, DGCai, JLiu, SWang, DWu, HYang, C Btk inhibitors US Patent  US10214546 Publication Date 2/26/2019 
Target
Name:
Tyrosine-protein kinase BTK
Synonyms:
AGMX1 Agammaglobulinaemia tyrosine kinase B cell progenitor kinase BPK BTK_HUMAN Tyrosine Kinase BTK Tyrosine-protein kinase BTK (BTK)
Type:
Enzyme
Mol. Mass.:
76289.95
Organism:
Homo sapiens (Human)
Description:
Q06187
Residue:
659
  
Inhibitor
Name:
BDBM358944
Synonyms:
(6R,8aS)-6-[8-amino-1- (4-{(1R)-1-hydroxy-1-[3(1- methylethyl)phenyl]ethyl} phenyl)imidazo[1,5- a]pyrazin-3- yl]hexahydroindolizin- 3(2H)-one | US10214546, Example 75
Type:
Small organic molecule
Emp. Form.:
C31H35N5O2
Mol. Mass.:
509.6419
SMILES:
CC(C)c1cccc(c1)[C@](C)(O)c1ccc(cc1)-c1nc([C@@H]2CC[C@H]3CCC(=O)N3C2)n2ccnc(N)c12
: