Target
Cytochrome P450 3A4
Ligand
BDBM198660
Substrate
IC50
81000±n/a nM
Citation
 Hoekstra, WJRafferty, SWYates, CMSchotzinger, RJLoso, MRSullenberger, MT Metalloenzyme inhibitor compounds US Patent  US9556143 Publication Date 1/31/2017 
Target
Name:
Cytochrome P450 3A4
Synonyms:
Albendazole monooxygenase CP3A4_HUMAN CYP3A4 CYPIIIA4 Cytochrome P450 3A4 (CYP3A4) Nifedipine oxidase Taurochenodeoxycholate 6-alpha-hydroxylase
Type:
Enzyme
Mol. Mass.:
57349.57
Organism:
Homo sapiens (Human)
Description:
Residue:
503
  
Inhibitor
Name:
BDBM198660
Synonyms:
US9221791, 6 | US9556143, 6
Type:
Small organic molecule
Emp. Form.:
C20H16F7N5O2
Mol. Mass.:
491.3622
SMILES:
OC(Cn1cnnn1)(c1ccc(F)cc1F)C(F)(F)c1ccc(\C=C\COCC(F)(F)F)cn1
: