Target
P2Y purinoceptor 13
Ligand
BDBM359090
Substrate
Meas. Tech.
Ca++ flux assay
EC50
48890±n/a nM
Citation
 Dasseux, JHBarbaras, R Compounds, compositions and methods useful for cholesterol mobilization US Patent  US10220040 Publication Date 3/5/2019 
Target
Name:
P2Y purinoceptor 13
Synonyms:
G-protein coupled receptor 86 GPR86 P2RY13 P2Y13_HUMAN
Type:
Enzyme Catalytic Domain
Mol. Mass.:
40817.42
Organism:
Homo sapiens (Human)
Description:
Residue:
354
  
Inhibitor
Name:
BDBM359090
Synonyms:
US10220040, Compound XIa
Type:
Small organic molecule
Emp. Form.:
C13H18N2O4
Mol. Mass.:
266.293
SMILES:
COCCNCC(=O)Nc1ccc2OCCOc2c1
: