Target
Bifunctional dihydrofolate reductase-thymidylate synthase
Ligand
BDBM18487
Substrate
BDBM18044
Meas. Tech.
Determination of IC50
pH
7±n/a
Temperature
298.15±n/a K
IC50
>1000000±n/a nM
Citation
 Pelphrey, PMPopov, VMJoska, TMBeierlein, JMBolstad, ESFillingham, YAWright, DLAnderson, AC Highly efficient ligands for dihydrofolate reductase from Cryptosporidium hominis and Toxoplasma gondii inspired by structural analysis. J Med Chem 50:940-50 (2007)  
Target
Name:
Bifunctional dihydrofolate reductase-thymidylate synthase
Synonyms:
ChDHFR-TS | Dihydrofolate Reductase (DHFR)
Type:
Enzyme
Mol. Mass.:
60186.98
Organism:
Cryptosporidium hominis
Description:
ChDHFR-TS was expressed in E. coli and purified using a methotrexate agarose column.
Residue:
521
  
Inhibitor
Name:
BDBM18487
Synonyms:
5-[(Z)-2-(3,4,5-trimethoxyphenyl)ethenyl]pyrimidine-2,4-diamine | TMP derivative containing cis-olefinic linker, 9
Type:
Small organic molecule
Emp. Form.:
C15H18N4O3
Mol. Mass.:
302.3284
SMILES:
COc1cc(\C=C/c2cnc(N)nc2N)cc(OC)c1OC
:
Substrate
Name:
BDBM18044
Synonyms:
(2S)-2-[(4-{[(2-amino-4-oxo-1,4,7,8-tetrahydropteridin-6-yl)methyl]amino}phenyl)formamido]pentanedioic acid dihydrofolic acid
Type:
Small organic molecule
Emp. Form.:
C19H21N7O6
Mol. Mass.:
443.4133
SMILES:
Nc1nc2NCC(CNc3ccc(cc3)C(=O)N[C@@H](CCC(O)=O)C(O)=O)=Nc2c(=O)[nH]1
: