Target
Dihydrofolate reductase
Ligand
BDBM18505
Substrate
BDBM18044
Meas. Tech.
In Vitro Inhibition Assay
pH
7±n/a
Temperature
298.15±n/a K
IC50
>1000000±n/a nM
Citation
 Joska, TMAnderson, AC Structure-activity relationships of Bacillus cereus and Bacillus anthracis dihydrofolate reductase: toward the identification of new potent drug leads. Antimicrob Agents Chemother 50:3435-43 (2006)  
Target
Name:
Dihydrofolate reductase
Synonyms:
Dihydrofolate Reductase (DHFR) | Tetrahydrofolate dehydrogenase
Type:
Enzyme
Mol. Mass.:
19144.66
Organism:
Bacillus cereus (ATCC 14579)
Description:
Q81E04
Residue:
162
  
Inhibitor
Name:
BDBM18505
Synonyms:
6-{[(5,7-dichloronaphthalen-2-yl)(methyl)amino]methyl}-7-methylpteridine-2,4-diamine | Pteridine compound, 16
Type:
Small organic molecule
Emp. Form.:
C19H17Cl2N7
Mol. Mass.:
414.291
SMILES:
CN(Cc1nc2c(N)nc(N)nc2nc1C)c1ccc2c(Cl)cc(Cl)cc2c1
:
Substrate
Name:
BDBM18044
Synonyms:
(2S)-2-[(4-{[(2-amino-4-oxo-1,4,7,8-tetrahydropteridin-6-yl)methyl]amino}phenyl)formamido]pentanedioic acid dihydrofolic acid
Type:
Small organic molecule
Emp. Form.:
C19H21N7O6
Mol. Mass.:
443.4133
SMILES:
Nc1nc2NCC(CNc3ccc(cc3)C(=O)N[C@@H](CCC(O)=O)C(O)=O)=Nc2c(=O)[nH]1
: