Target
Receptor-type tyrosine-protein phosphatase beta
Ligand
BDBM359091
Substrate
Meas. Tech.
HPTP Assay
IC50
0.157±n/a nM
Citation
 Peters, KShalwitz, R Compositions and methods for treating ocular diseases US Patent  US10220048 Publication Date 3/5/2019 
Target
Name:
Receptor-type tyrosine-protein phosphatase beta
Synonyms:
PTPB PTPRB_HUMAN R-PTP-beta Receptor-type tyrosine-protein phosphatase beta (PTPβ) Vascular endothelial protein tyrosine phosphatase
Type:
Protein
Mol. Mass.:
224324.80
Organism:
Homo sapiens (Human)
Description:
P23467
Residue:
1997
  
Inhibitor
Name:
BDBM359091
Synonyms:
US10220048, Compound AA1 US10952992, No. AA75 US11666558, Example AA1
Type:
Small organic molecule
Emp. Form.:
C21H23N3O4S2
Mol. Mass.:
445.555
SMILES:
CCc1csc(n1)[C@H](Cc1ccc(NS(O)(=O)=O)cc1)NC(=O)Cc1ccccc1
: