Target
Receptor-type tyrosine-protein phosphatase beta
Ligand
BDBM359137
Substrate
Meas. Tech.
HPTP Assay
IC50
0.300±n/a nM
Citation
 Peters, KShalwitz, R Compositions and methods for treating ocular diseases US Patent  US10220048 Publication Date 3/5/2019 
Target
Name:
Receptor-type tyrosine-protein phosphatase beta
Synonyms:
PTPB PTPRB_HUMAN R-PTP-beta Receptor-type tyrosine-protein phosphatase beta (PTPβ) Vascular endothelial protein tyrosine phosphatase
Type:
Protein
Mol. Mass.:
224324.80
Organism:
Homo sapiens (Human)
Description:
P23467
Residue:
1997
  
Inhibitor
Name:
BDBM359137
Synonyms:
US10220048, Compound AA47 US11413242, Compound AA47 | US11666558, Example AA47
Type:
Small organic molecule
Emp. Form.:
C21H30N4O6S2
Mol. Mass.:
498.616
SMILES:
CCc1csc(n1)[C@H](Cc1ccc(NS(O)(=O)=O)cc1)NC(=O)[C@H](CC(C)C)NC(=O)OC
: