Target
Receptor-type tyrosine-protein phosphatase beta
Ligand
BDBM359159
Substrate
Meas. Tech.
HPTP Assay
IC50
167±n/a nM
Citation
 Peters, KShalwitz, R Compositions and methods for treating ocular diseases US Patent  US10220048 Publication Date 3/5/2019 
Target
Name:
Receptor-type tyrosine-protein phosphatase beta
Synonyms:
PTPB PTPRB_HUMAN R-PTP-beta Receptor-type tyrosine-protein phosphatase beta (PTPβ) Vascular endothelial protein tyrosine phosphatase
Type:
Protein
Mol. Mass.:
224324.80
Organism:
Homo sapiens (Human)
Description:
P23467
Residue:
1997
  
Inhibitor
Name:
BDBM359159
Synonyms:
US10220048, Compound AA69 US11413242, Compound AA69 | US11666558, Example AA69
Type:
Small organic molecule
Emp. Form.:
C20H27N3O7S2
Mol. Mass.:
485.574
SMILES:
CCOC(=O)Cc1csc(n1)[C@H](Cc1ccc(NS(O)(=O)=O)cc1)NC(=O)OC(C)(C)C
: