Target
Tyrosine-protein kinase JAK2
Ligand
BDBM234955
Substrate
JAK2
Meas. Tech.
In Vitro Assay
Temperature
298.15±n/a K
IC50
11±n/a nM
Comments
extracted
Citation
 Desai, RDesai, JPatel, P N-cyanomethylamides as inhibitors of janus kinase US Patent  US9556148 Publication Date 1/31/2017 
Target
Name:
Tyrosine-protein kinase JAK2
Synonyms:
JAK-2 JAK2_HUMAN Janus kinase 2 (JAK2) | Janus kinase 2 (a protein tyrosine kinase)
Type:
Protein
Mol. Mass.:
130684.68
Organism:
Homo sapiens (Human)
Description:
O60674
Residue:
1132
  
Inhibitor
Name:
BDBM234955
Synonyms:
US9556148, 18 | n-(cyanomethyl)-4-(2-((4-(4-(2-oxoimidazolidin-1-yl)piperidin-1-yl)phenyl)amino)pyrimidin-4-yl)benzamide
Type:
Small organic molecule
Emp. Form.:
C27H28N8O2
Mol. Mass.:
496.5636
SMILES:
O=C(NCC#N)c1ccc(cc1)-c1ccnc(Nc2ccc(cc2)N2CCC(CC2)N2CCNC2=O)n1
:
Substrate
Name:
Tyrosine-protein kinase JAK2
Synonyms:
JAK-2 JAK2_HUMAN Janus kinase 2 (JAK2) | Janus kinase 2 (a protein tyrosine kinase)
Type:
Protein
Mol. Mass.:
130684.68
Organism:
Homo sapiens (Human)
Description:
O60674
Residue:
1132