Target
Tyrosine-protein kinase JAK3
Ligand
BDBM234956
Substrate
JAK2
Meas. Tech.
In Vitro Assay
Temperature
298.15±n/a K
IC50
40±n/a nM
Comments
extracted
Citation
 Desai, RDesai, JPatel, P N-cyanomethylamides as inhibitors of janus kinase US Patent  US9556148 Publication Date 1/31/2017 
Target
Name:
Tyrosine-protein kinase JAK3
Synonyms:
JAK-3 JAK3_HUMAN Janus kinase 3 (JAK3) L-JAK | Leukocyte janus kinase
Type:
Protein
Mol. Mass.:
125111.08
Organism:
Homo sapiens (Human)
Description:
P52333
Residue:
1124
  
Inhibitor
Name:
BDBM234956
Synonyms:
4-(2-((4-(4-(1,3,4-oxadiazol-2-yl)piperidin-1-yl)phenyl)amino)pyrimidin-4-yl)-n-(cyanomethyl)benzamide | US9556148, 19
Type:
Small organic molecule
Emp. Form.:
C26H24N8O2
Mol. Mass.:
480.5212
SMILES:
O=C(NCC#N)c1ccc(cc1)-c1ccnc(Nc2ccc(cc2)N2CCC(CC2)c2nnco2)n1
:
Substrate
Name:
Tyrosine-protein kinase JAK2
Synonyms:
JAK-2 JAK2_HUMAN Janus kinase 2 (JAK2) | Janus kinase 2 (a protein tyrosine kinase)
Type:
Protein
Mol. Mass.:
130684.68
Organism:
Homo sapiens (Human)
Description:
O60674
Residue:
1132