Target
Tyrosine-protein kinase JAK3
Ligand
BDBM234963
Substrate
JAK2
Meas. Tech.
In Vitro Assay
Temperature
298.15±n/a K
IC50
54±n/a nM
Comments
extracted
Citation
 Desai, RDesai, JPatel, P N-cyanomethylamides as inhibitors of janus kinase US Patent  US9556148 Publication Date 1/31/2017 
Target
Name:
Tyrosine-protein kinase JAK3
Synonyms:
JAK-3 JAK3_HUMAN Janus kinase 3 (JAK3) L-JAK | Leukocyte janus kinase
Type:
Protein
Mol. Mass.:
125111.08
Organism:
Homo sapiens (Human)
Description:
P52333
Residue:
1124
  
Inhibitor
Name:
BDBM234963
Synonyms:
US9556148, 33 | n-(cyanomethyl)-4-(2-((4-(4-(4,5-dihydro-1h-imidazol-2-yl)piperazin-1-yl)phenyl)amino)pyrimidin-4-yl)benzamide
Type:
Small organic molecule
Emp. Form.:
C26H27N9O
Mol. Mass.:
481.5523
SMILES:
O=C(NCC#N)c1ccc(cc1)-c1ccnc(Nc2ccc(cc2)N2CCN(CC2)C2=NCCN2)n1
:
Substrate
Name:
Tyrosine-protein kinase JAK2
Synonyms:
JAK-2 JAK2_HUMAN Janus kinase 2 (JAK2) | Janus kinase 2 (a protein tyrosine kinase)
Type:
Protein
Mol. Mass.:
130684.68
Organism:
Homo sapiens (Human)
Description:
O60674
Residue:
1132