Target
Tyrosine-protein kinase JAK1
Ligand
BDBM234967
Substrate
JAK2
Meas. Tech.
In Vitro Assay
Temperature
298.15±n/a K
IC50
1.5±n/a nM
Comments
extracted
Citation
 Desai, RDesai, JPatel, P N-cyanomethylamides as inhibitors of janus kinase US Patent  US9556148 Publication Date 1/31/2017 
Target
Name:
Tyrosine-protein kinase JAK1
Synonyms:
JAK-1 JAK1A JAK1_HUMAN Janus kinase 1 (JAK1) | Janus kinase 1 JAK1
Type:
Protein
Mol. Mass.:
133293.73
Organism:
Homo sapiens (Human)
Description:
P23458
Residue:
1154
  
Inhibitor
Name:
BDBM234967
Synonyms:
4-(2-((4-(4-(8-oxa-3-azabicyclo[3.2.1]octan-3-yl)piperidin-1-yl)phenyl)amino)pyrimidin-4-yl)-n-(cyanomethyl)benzamide | US9556148, 38
Type:
Small organic molecule
Emp. Form.:
C30H33N7O2
Mol. Mass.:
523.6287
SMILES:
O=C(NCC#N)c1ccc(cc1)-c1ccnc(Nc2ccc(cc2)N2CCC(CC2)N2C3CCC2COC3)n1
:
Substrate
Name:
Tyrosine-protein kinase JAK2
Synonyms:
JAK-2 JAK2_HUMAN Janus kinase 2 (JAK2) | Janus kinase 2 (a protein tyrosine kinase)
Type:
Protein
Mol. Mass.:
130684.68
Organism:
Homo sapiens (Human)
Description:
O60674
Residue:
1132