Target
Tyrosine-protein kinase JAK1
Ligand
BDBM234968
Substrate
JAK2
Meas. Tech.
In Vitro Assay
Temperature
298.15±n/a K
IC50
8.8±n/a nM
Comments
extracted
Citation
 Desai, RDesai, JPatel, P N-cyanomethylamides as inhibitors of janus kinase US Patent  US9556148 Publication Date 1/31/2017 
Target
Name:
Tyrosine-protein kinase JAK1
Synonyms:
JAK-1 JAK1A JAK1_HUMAN Janus kinase 1 (JAK1) | Janus kinase 1 JAK1
Type:
Protein
Mol. Mass.:
133293.73
Organism:
Homo sapiens (Human)
Description:
P23458
Residue:
1154
  
Inhibitor
Name:
BDBM234968
Synonyms:
4-(2-((4-(4-(6-acetyl-3,6-diazabicyclo[3.1.1]heptan-3-yl)piperidin-1-yl)phenyl)amino)pyrimidin-4-yl)-n-(cyanomethyl)benzamide | US9556148, 39
Type:
Small organic molecule
Emp. Form.:
C31H34N8O2
Mol. Mass.:
550.6541
SMILES:
CC(=O)N1C2CC1CN(C2)C1CCN(CC1)c1ccc(Nc2nccc(n2)-c2ccc(cc2)C(=O)NCC#N)cc1
:
Substrate
Name:
Tyrosine-protein kinase JAK2
Synonyms:
JAK-2 JAK2_HUMAN Janus kinase 2 (JAK2) | Janus kinase 2 (a protein tyrosine kinase)
Type:
Protein
Mol. Mass.:
130684.68
Organism:
Homo sapiens (Human)
Description:
O60674
Residue:
1132