Target
Envelope glycoprotein gp160
Ligand
BDBM359317
Substrate
Meas. Tech.
Biological Methods
EC50
4590±n/a nM
Citation
 Bender, JAGentles, RGPendri, AWang, AXMeanwell, NABeno, BRFridell, RABelema, MNguyen, VNYang, ZWang, GKumaravel, SThangathirupathy, SBora, ROHolehatti, SMMettu, MRPanda, M Inhibitors of human immunodeficiency virus replication US Patent  US10221129 Publication Date 3/5/2019 
Target
Name:
Envelope glycoprotein gp160
Synonyms:
Env polyprotein | NL4-3
Type:
Enzyme Catalytic Domain
Mol. Mass.:
97031.14
Organism:
Human immunodeficiency virus type 1 (isolate BRU/LAI group M subtypeB) (HIV-1)
Description:
Residue:
854
  
Inhibitor
Name:
BDBM359317
Synonyms:
US10221129, Example CA-51
Type:
Small organic molecule
Emp. Form.:
C24H31N5O6S
Mol. Mass.:
517.598
SMILES:
COc1ccc(cc1)N(C)C(=O)[C@H](Cc1ccccc1)NC(=O)NS(=O)(=O)NCC(=O)N1CCCC1
: